Reaction Details
TargetMast/stem cell growth factor receptor Kit
LigandBDBM50425385
Substrate/Competitorn/a
Meas. Tech.ChEMBL_934830 (CHEMBL2319223)
Kd 3.5±n/a nM
Citation Duveau, DYHu, XWalsh, MJShukla, SSkoumbourdis, APBoxer, MBAmbudkar, SVShen, MThomas, CJ Synthesis and biological evaluation of analogues of the kinase inhibitor nilotinib as Abl and Kit inhibitors. Bioorg Med Chem Lett23:682-6 (2013) 
 
Mast/stem cell growth factor receptor Kit
Name:Mast/stem cell growth factor receptor Kit
Type:Protein
Mol. Mass.:109869.37
Organism:Homo sapiens (Human)
Description:P10721
Residue:976
BDBM50425385
NameBDBM50425385
Synonyms:CHEMBL2311807
TypeSmall organic molecule
Emp. Form.C27H22FN7O
Mol. Mass.479.5083
SMILESCc1cn(cn1)-c1cc(F)cc(NC(=O)c2ccc(C)c(Nc3nccc(n3)-c3cccnc3)c2)c1