Reaction Details
TargetPlatelet-derived growth factor receptor alpha
LigandBDBM50425386
Substrate/Competitorn/a
Meas. Tech.ChEMBL_934836 (CHEMBL2319489)
IC50 84±n/a nM
Citation Duveau, DYHu, XWalsh, MJShukla, SSkoumbourdis, APBoxer, MBAmbudkar, SVShen, MThomas, CJ Synthesis and biological evaluation of analogues of the kinase inhibitor nilotinib as Abl and Kit inhibitors. Bioorg Med Chem Lett23:682-6 (2013) 
 
Platelet-derived growth factor receptor alpha
Name:Platelet-derived growth factor receptor alpha
Type:Protein
Mol. Mass.:122633.38
Organism:Homo sapiens (Human)
Description:P16234
Residue:1089
BDBM50425386
NameBDBM50425386
Synonyms:CHEMBL2311808
TypeSmall organic molecule
Emp. Form.C27H23N7O
Mol. Mass.461.5178
SMILESCc1cn(cn1)-c1cccc(NC(=O)c2ccc(C)c(Nc3nccc(n3)-c3cccnc3)c2)c1