Reaction Details
TargetTyrosine-protein kinase ABL1
LigandBDBM50425387
Substrate/Competitorn/a
Meas. Tech.ChEMBL_934839 (CHEMBL2319492)
IC50 136±n/a nM
Citation Duveau, DYHu, XWalsh, MJShukla, SSkoumbourdis, APBoxer, MBAmbudkar, SVShen, MThomas, CJ Synthesis and biological evaluation of analogues of the kinase inhibitor nilotinib as Abl and Kit inhibitors. Bioorg Med Chem Lett23:682-6 (2013) 
 
Tyrosine-protein kinase ABL1
Name:Tyrosine-protein kinase ABL1
Type:Enzyme
Mol. Mass.:122897.30
Organism:Homo sapiens (Human)
Description:P00519
Residue:1130
BDBM50425387
NameBDBM50425387
Synonyms:CHEMBL2311806
TypeSmall organic molecule
Emp. Form.C28H25N7O
Mol. Mass.475.5444
SMILESCc1cn(cn1)-c1cc(C)cc(NC(=O)c2ccc(C)c(Nc3nccc(n3)-c3cccnc3)c2)c1