Reaction Details
TargetReceptor-type tyrosine-protein kinase FLT3
LigandBDBM50425385
Substrate/Competitorn/a
Meas. Tech.ChEMBL_934832 (CHEMBL2319225)
Kd 58±n/a nM
Citation Duveau, DYHu, XWalsh, MJShukla, SSkoumbourdis, APBoxer, MBAmbudkar, SVShen, MThomas, CJ Synthesis and biological evaluation of analogues of the kinase inhibitor nilotinib as Abl and Kit inhibitors. Bioorg Med Chem Lett23:682-6 (2013) 
 
Receptor-type tyrosine-protein kinase FLT3
Name:Receptor-type tyrosine-protein kinase FLT3
Type:Enzyme
Mol. Mass.:112888.62
Organism:Homo sapiens (Human)
Description:P36888
Residue:993
BDBM50425385
NameBDBM50425385
Synonyms:CHEMBL2311807
TypeSmall organic molecule
Emp. Form.C27H22FN7O
Mol. Mass.479.5083
SMILESCc1cn(cn1)-c1cc(F)cc(NC(=O)c2ccc(C)c(Nc3nccc(n3)-c3cccnc3)c2)c1