Reaction Details
TargetMast/stem cell growth factor receptor Kit
LigandBDBM50425386
Substrate/Competitorn/a
Meas. Tech.ChEMBL_934840 (CHEMBL2319493)
IC50 33±n/a nM
Citation Duveau, DYHu, XWalsh, MJShukla, SSkoumbourdis, APBoxer, MBAmbudkar, SVShen, MThomas, CJ Synthesis and biological evaluation of analogues of the kinase inhibitor nilotinib as Abl and Kit inhibitors. Bioorg Med Chem Lett23:682-6 (2013) 
 
Mast/stem cell growth factor receptor Kit
Name:Mast/stem cell growth factor receptor Kit
Type:Protein
Mol. Mass.:109869.37
Organism:Homo sapiens (Human)
Description:P10721
Residue:976
BDBM50425386
NameBDBM50425386
Synonyms:CHEMBL2311808
TypeSmall organic molecule
Emp. Form.C27H23N7O
Mol. Mass.461.5178
SMILESCc1cn(cn1)-c1cccc(NC(=O)c2ccc(C)c(Nc3nccc(n3)-c3cccnc3)c2)c1