Reaction Details
TargetPlatelet-derived growth factor receptor beta
LigandBDBM50237710
Substrate/Competitorn/a
Meas. Tech.ChEMBL_934833 (CHEMBL2319226)
IC50 60±n/a nM
Citation Duveau, DYHu, XWalsh, MJShukla, SSkoumbourdis, APBoxer, MBAmbudkar, SVShen, MThomas, CJ Synthesis and biological evaluation of analogues of the kinase inhibitor nilotinib as Abl and Kit inhibitors. Bioorg Med Chem Lett23:682-6 (2013) 
 
Platelet-derived growth factor receptor beta
Name:Platelet-derived growth factor receptor beta
Type:Enzyme
Mol. Mass.:123922.25
Organism:Homo sapiens (Human)
Description:P09619
Residue:1106
BDBM50237710
NameBDBM50237710
Synonyms:4-methyl-N-[3-(4-methyl-1H-imidazol-1-yl)-5-(trifluoromethyl)phenyl]-3-[(4-pyridin-3-ylpyrimidin-2-yl)amino]benzamide AMN107 NILOTINIB | US11649218, Example Nilotinib
TypeSmall organic molecule
Emp. Form.C28H22F3N7O
Mol. Mass.529.5158
SMILESCc1cn(cn1)-c1cc(NC(=O)c2ccc(C)c(Nc3nccc(n3)-c3cccnc3)c2)cc(c1)C(F)(F)F