Reaction Details
TargetMast/stem cell growth factor receptor Kit
LigandBDBM50237710
Substrate/Competitorn/a
Meas. Tech.ChEMBL_934840 (CHEMBL2319493)
IC50 15±n/a nM
Citation Duveau, DYHu, XWalsh, MJShukla, SSkoumbourdis, APBoxer, MBAmbudkar, SVShen, MThomas, CJ Synthesis and biological evaluation of analogues of the kinase inhibitor nilotinib as Abl and Kit inhibitors. Bioorg Med Chem Lett23:682-6 (2013) 
 
Mast/stem cell growth factor receptor Kit
Name:Mast/stem cell growth factor receptor Kit
Type:Protein
Mol. Mass.:109869.37
Organism:Homo sapiens (Human)
Description:P10721
Residue:976
BDBM50237710
NameBDBM50237710
Synonyms:4-methyl-N-[3-(4-methyl-1H-imidazol-1-yl)-5-(trifluoromethyl)phenyl]-3-[(4-pyridin-3-ylpyrimidin-2-yl)amino]benzamide AMN107 NILOTINIB | US11649218, Example Nilotinib
TypeSmall organic molecule
Emp. Form.C28H22F3N7O
Mol. Mass.529.5158
SMILESCc1cn(cn1)-c1cc(NC(=O)c2ccc(C)c(Nc3nccc(n3)-c3cccnc3)c2)cc(c1)C(F)(F)F