Reaction Details
TargetThyroid hormone receptor alpha
LigandBDBM50425407
Substrate/Competitorn/a
Meas. Tech.ChEMBL_935147 (CHEMBL2317309)
Ki 31±n/a nM
Citation Shiohara, HNakamura, TKikuchi, NOzawa, TMatsuzawa, ANagano, ROhnota, HMiyamoto, TIchikawa, KHashizume, K Design, synthesis, and structure-activity relationship (SAR) of N-[7-(4-hydroxyphenoxy)-6-methylindan-4-yl]malonamic acids as thyroid hormone receptorß (TRß) selective agonists. Bioorg Med Chem21:592-607 (2013) 
 
Thyroid hormone receptor alpha
Name:Thyroid hormone receptor alpha
Type:Receptor
Mol. Mass.:54818.00
Organism:Homo sapiens (Human)
Description:Recombinant hThR was obtained from nuclear extracts from SF9 cells infected with baculovirus vectors encoding for ThRalpha 1.
Residue:490
BDBM50425407
NameBDBM50425407
Synonyms:CHEMBL2312281
TypeSmall organic molecule
Emp. Form.C26H24FNO5
Mol. Mass.449.4709
SMILESCc1cc(NC(=O)CC(O)=O)c2CCCc2c1Oc1ccc(O)c(Cc2ccc(F)cc2)c1