Reaction Details
TargetAdenosine receptor A2a
LigandBDBM50047166
Substrate/Competitorn/a
Meas. Tech.ChEMBL_935777 (CHEMBL2317357)
Ki 18±n/a nM
Citation Rivara, SPiersanti, GBartoccini, FDiamantini, GPala, DRiccioni, TStasi, MACabri, WBorsini, FMor, MTarzia, GMinetti, P Synthesis of (E)-8-(3-chlorostyryl)caffeine analogues leading to 9-deazaxanthine derivatives as dual A(2A) antagonists/MAO-B inhibitors. J Med Chem56:1247-61 (2013) 
 
Adenosine receptor A2a
Name:Adenosine receptor A2a
Type:G Protein-Coupled Receptor (GPCR)
Mol. Mass.:45015.65
Organism:Rattus norvegicus (rat)
Description:Rat A2A receptors expressed in CHO cells.
Residue:410
BDBM50047166
NameBDBM50047166
Synonyms:8-[(E)-2-(3,4-Dimethoxy-phenyl)-vinyl]-1,3,7-trimethyl-3,7-dihydro-purine-2,6-dione CHEMBL280982
TypeSmall organic molecule
Emp. Form.C18H20N4O4
Mol. Mass.356.3758
SMILESCOc1ccc(\C=C\c2nc3n(C)c(=O)n(C)c(=O)c3n2C)cc1OC