Reaction Details
TargetSubstance-P receptor
LigandBDBM50425521
Substrate/Competitorn/a
Meas. Tech.ChEMBL_936062 (CHEMBL2319304)
Ki 120±n/a nM
Citation Bornot, ABauer, UBrown, AFirth, MHellawell, CEngkvist, O Systematic exploration of dual-acting modulators from a combined medicinal chemistry and biology perspective. J Med Chem56:1197-210 (2013) 
 
Substance-P receptor
Name:Substance-P receptor
Type:G Protein-Coupled Receptor (GPCR)
Mol. Mass.:46254.43
Organism:Homo sapiens (Human)
Description:P25103
Residue:407
BDBM50425521
NameBDBM50425521
Synonyms:CHEMBL2313631
TypeSmall organic molecule
Emp. Form.C26H32N4O3
Mol. Mass.448.5573
SMILESCCOC(=O)N(C1CCN(CCn2c3ccccc3n(C3CC3)c2=O)CC1)c1ccccc1