Reaction Details
TargetRap guanine nucleotide exchange factor 4
LigandBDBM50425531
Substrate/Competitorn/a
Meas. Tech.ChEMBL_936073 (CHEMBL2319315)
IC50 300±n/a nM
Citation Chen, HTsalkova, TChepurny, OGMei, FCHolz, GGCheng, XZhou, J Identification and characterization of small molecules as potent and specific EPAC2 antagonists. J Med Chem56:952-62 (2013) 
 
Rap guanine nucleotide exchange factor 4
Name:Rap guanine nucleotide exchange factor 4
Type:PROTEIN
Mol. Mass.:115526.83
Organism:Homo sapiens (Human)
Description:ChEMBL_1504794
Residue:1011
BDBM50425531
NameBDBM50425531
Synonyms:CHEMBL2313646
TypeSmall organic molecule
Emp. Form.C15H19NO2S
Mol. Mass.277.382
SMILESCc1cc(C)n(c1)S(=O)(=O)c1c(C)cc(C)cc1C