Reaction Details
TargetRap guanine nucleotide exchange factor 4
LigandBDBM50294336
Substrate/Competitorn/a
Meas. Tech.ChEMBL_936073 (CHEMBL2319315)
IC50 18000±n/a nM
Citation Chen, HTsalkova, TChepurny, OGMei, FCHolz, GGCheng, XZhou, J Identification and characterization of small molecules as potent and specific EPAC2 antagonists. J Med Chem56:952-62 (2013) 
 
Rap guanine nucleotide exchange factor 4
Name:Rap guanine nucleotide exchange factor 4
Type:PROTEIN
Mol. Mass.:115526.83
Organism:Homo sapiens (Human)
Description:ChEMBL_1504794
Residue:1011
BDBM50294336
NameBDBM50294336
Synonyms:5-amino-2-(4-aminophenylamino)benzenesulfonic acid | CHEMBL560968
TypeSmall organic molecule
Emp. Form.C12H13N3O3S
Mol. Mass.279.315
SMILESNc1ccc(Nc2ccc(N)cc2S(O)(=O)=O)cc1