Reaction Details
TargetCytochrome P450 2D6
LigandBDBM50425649
Substrate/Competitorn/a
Meas. Tech.ChEMBL_937183 (CHEMBL2318289)
IC50>40000±n/a nM
Citation Saupe, SMLeubner, SBetz, MKlebe, GSteinmetzer, T Development of new cyclic plasmin inhibitors with excellent potency and selectivity. J Med Chem56:820-31 (2013) 
 
Cytochrome P450 2D6
Name:Cytochrome P450 2D6
Type:Protein
Mol. Mass.:55774.82
Organism:Homo sapiens (Human)
Description:P10635
Residue:497
BDBM50425649
NameBDBM50425649
Synonyms:CHEMBL2315239
TypeSmall organic molecule
Emp. Form.C41H47N9O6S
Mol. Mass.793.934
SMILESNC(=N)c1ccc(CNC(=O)[C@@H]2Cc3ccc(NC(=O)CN4CCN(CC4)CC(=O)Nc4ccc(C[C@@H](NS(=O)(=O)Cc5ccccc5)C(=O)N2)cc4)cc3)cc1