Reaction Details
TargetSerine protease 1
LigandBDBM50425649
Substrate/Competitorn/a
Meas. Tech.ChEMBL_937196 (CHEMBL2318522)
Ki 44±n/a nM
Citation Saupe, SMLeubner, SBetz, MKlebe, GSteinmetzer, T Development of new cyclic plasmin inhibitors with excellent potency and selectivity. J Med Chem56:820-31 (2013) 
 
Serine protease 1
Name:Serine protease 1
Type:Enzyme
Mol. Mass.:26557.80
Organism:Homo sapiens (Human)
Description:P07477
Residue:247
BDBM50425649
NameBDBM50425649
Synonyms:CHEMBL2315239
TypeSmall organic molecule
Emp. Form.C41H47N9O6S
Mol. Mass.793.934
SMILESNC(=N)c1ccc(CNC(=O)[C@@H]2Cc3ccc(NC(=O)CN4CCN(CC4)CC(=O)Nc4ccc(C[C@@H](NS(=O)(=O)Cc5ccccc5)C(=O)N2)cc4)cc3)cc1