Reaction Details
TargetVitamin K-dependent protein C
LigandBDBM50425650
Substrate/Competitorn/a
Meas. Tech.ChEMBL_937463 (CHEMBL2320211)
Ki 1600±n/a nM
Citation Saupe, SMLeubner, SBetz, MKlebe, GSteinmetzer, T Development of new cyclic plasmin inhibitors with excellent potency and selectivity. J Med Chem56:820-31 (2013) 
 
Vitamin K-dependent protein C
Name:Vitamin K-dependent protein C
Type:Enzyme
Mol. Mass.:52067.73
Organism:Homo sapiens (Human)
Description:n/a
Residue:461
BDBM50425650
NameBDBM50425650
Synonyms:CHEMBL2315238
TypeSmall organic molecule
Emp. Form.C44H53N9O6S
Mol. Mass.836.013
SMILESC[C@H]1CN2CC(=O)Nc3ccc(C[C@H](NC(=O)[C@@H](Cc4ccc(CNC(=O)CN1C[C@@H]2C)cc4)NS(=O)(=O)Cc1ccccc1)C(=O)NCc1ccc(cc1)C(N)=N)cc3