Reaction Details
TargetVitamin K-dependent protein C
LigandBDBM50425652
Substrate/Competitorn/a
Meas. Tech.ChEMBL_937463 (CHEMBL2320211)
Ki>20000±n/a nM
Citation Saupe, SMLeubner, SBetz, MKlebe, GSteinmetzer, T Development of new cyclic plasmin inhibitors with excellent potency and selectivity. J Med Chem56:820-31 (2013) 
 
Vitamin K-dependent protein C
Name:Vitamin K-dependent protein C
Type:Enzyme
Mol. Mass.:52067.73
Organism:Homo sapiens (Human)
Description:n/a
Residue:461
BDBM50425652
NameBDBM50425652
Synonyms:CHEMBL2315234
TypeSmall organic molecule
Emp. Form.C43H51N9O6S
Mol. Mass.821.987
SMILESC[C@H]1CN2CC(=O)Nc3ccc(C[C@@H](NS(=O)(=O)Cc4ccccc4)C(=O)N[C@@H](Cc4ccc(NC(=O)CN1C[C@H]2C)cc4)C(=O)NCc1ccc(cc1)C(N)=N)cc3