Reaction Details
TargetCoagulation factor X
LigandBDBM50425656
Substrate/Competitorn/a
Meas. Tech.ChEMBL_937468 (CHEMBL2320216)
Ki 7357±n/a nM
Citation Saupe, SMLeubner, SBetz, MKlebe, GSteinmetzer, T Development of new cyclic plasmin inhibitors with excellent potency and selectivity. J Med Chem56:820-31 (2013) 
 
Coagulation factor X
Name:Coagulation factor X
Type:Enzyme
Mol. Mass.:54726.60
Organism:Homo sapiens (Human)
Description:n/a
Residue:488
BDBM50425656
NameBDBM50425656
Synonyms:CHEMBL2315246
TypeSmall organic molecule
Emp. Form.C42H49N9O6S
Mol. Mass.807.96
SMILESNC(=N)c1ccc(CNC(=O)[C@@H]2Cc3ccc(NC(=O)CN4CCCN(CC4)CC(=O)Nc4ccc(C[C@@H](NS(=O)(=O)Cc5ccccc5)C(=O)N2)cc4)cc3)cc1