Reaction Details
TargetProthrombin
LigandBDBM50425650
Substrate/Competitorn/a
Meas. Tech.ChEMBL_937464 (CHEMBL2320212)
Ki 2950±n/a nM
Citation Saupe, SMLeubner, SBetz, MKlebe, GSteinmetzer, T Development of new cyclic plasmin inhibitors with excellent potency and selectivity. J Med Chem56:820-31 (2013) 
 
Prothrombin
Name:Prothrombin
Type:Protein
Mol. Mass.:70029.57
Organism:Homo sapiens (Human)
Description:P00734
Residue:622
BDBM50425650
NameBDBM50425650
Synonyms:CHEMBL2315238
TypeSmall organic molecule
Emp. Form.C44H53N9O6S
Mol. Mass.836.013
SMILESC[C@H]1CN2CC(=O)Nc3ccc(C[C@H](NC(=O)[C@@H](Cc4ccc(CNC(=O)CN1C[C@@H]2C)cc4)NS(=O)(=O)Cc1ccccc1)C(=O)NCc1ccc(cc1)C(N)=N)cc3