Reaction Details
TargetPlasma kallikrein
LigandBDBM50425654
Substrate/Competitorn/a
Meas. Tech.ChEMBL_937466 (CHEMBL2320214)
Ki 187±n/a nM
Citation Saupe, SMLeubner, SBetz, MKlebe, GSteinmetzer, T Development of new cyclic plasmin inhibitors with excellent potency and selectivity. J Med Chem56:820-31 (2013) 
 
Plasma kallikrein
Name:Plasma kallikrein
Type:Protein
Mol. Mass.:71391.16
Organism:Homo sapiens (Human)
Description:P03952
Residue:638
BDBM50425654
NameBDBM50425654
Synonyms:CHEMBL2315236
TypeSmall organic molecule
Emp. Form.C42H49N9O6S
Mol. Mass.807.96
SMILESNC(=N)c1ccc(CNC(=O)[C@@H]2Cc3ccc(NC(=O)CN4CCN(CC4)CC(=O)NCc4ccc(C[C@@H](NS(=O)(=O)Cc5ccccc5)C(=O)N2)cc4)cc3)cc1