Reaction Details
TargetPlasma kallikrein
LigandBDBM50425651
Substrate/Competitorn/a
Meas. Tech.ChEMBL_937466 (CHEMBL2320214)
Ki 242±n/a nM
Citation Saupe, SMLeubner, SBetz, MKlebe, GSteinmetzer, T Development of new cyclic plasmin inhibitors with excellent potency and selectivity. J Med Chem56:820-31 (2013) 
 
Plasma kallikrein
Name:Plasma kallikrein
Type:Protein
Mol. Mass.:71391.16
Organism:Homo sapiens (Human)
Description:P03952
Residue:638
BDBM50425651
NameBDBM50425651
Synonyms:CHEMBL2315235
TypeSmall organic molecule
Emp. Form.C43H51N9O6S
Mol. Mass.821.987
SMILESC[C@H]1CN2CC(=O)Nc3ccc(C[C@@H](NS(=O)(=O)Cc4ccccc4)C(=O)N[C@@H](Cc4ccc(NC(=O)CN1C[C@@H]2C)cc4)C(=O)NCc1ccc(cc1)C(N)=N)cc3