Reaction Details
TargetBaculoviral IAP repeat-containing protein 3
LigandBDBM50425725
Substrate/Competitorn/a
Meas. Tech.ChEMBL_937825 (CHEMBL2318322)
IC50 2.6±n/a nM
Citation Hashimoto, KSaito, BMiyamoto, NOguro, YTomita, DShiokawa, ZAsano, MKakei, HTaya, NKawasaki, MSumi, HYabuki, MIwai, KYoshida, SYoshimatsu, MAoyama, KKosugi, YKojima, TMorishita, NDougan, DRSnell, GPImamura, SIshikawa, T Design and synthesis of potent inhibitor of apoptosis (IAP) proteins antagonists bearing an octahydropyrrolo[1,2-a]pyrazine scaffold as a novel proline mimetic. J Med Chem56:1228-46 (2013) 
 
Baculoviral IAP repeat-containing protein 3
Name:Baculoviral IAP repeat-containing protein 3
Type:Protein
Mol. Mass.:68365.75
Organism:Homo sapiens (Human)
Description:Q13489
Residue:604
BDBM50425725
NameBDBM50425725
Synonyms:CHEMBL2316224
TypeSmall organic molecule
Emp. Form.C29H37N5O4
Mol. Mass.519.6352
SMILESCN[C@@H](C)C(=O)N[C@H](C(=O)N1C[C@H]2CCCN2C[C@H]1C(=O)N[C@@H]1CCOc2ccccc12)c1ccccc1