Reaction Details
TargetBaculoviral IAP repeat-containing protein 3
LigandBDBM50425726
Substrate/Competitorn/a
Meas. Tech.ChEMBL_937825 (CHEMBL2318322)
IC50 7.6±n/a nM
Citation Hashimoto, KSaito, BMiyamoto, NOguro, YTomita, DShiokawa, ZAsano, MKakei, HTaya, NKawasaki, MSumi, HYabuki, MIwai, KYoshida, SYoshimatsu, MAoyama, KKosugi, YKojima, TMorishita, NDougan, DRSnell, GPImamura, SIshikawa, T Design and synthesis of potent inhibitor of apoptosis (IAP) proteins antagonists bearing an octahydropyrrolo[1,2-a]pyrazine scaffold as a novel proline mimetic. J Med Chem56:1228-46 (2013) 
 
Baculoviral IAP repeat-containing protein 3
Name:Baculoviral IAP repeat-containing protein 3
Type:Protein
Mol. Mass.:68365.75
Organism:Homo sapiens (Human)
Description:Q13489
Residue:604
BDBM50425726
NameBDBM50425726
Synonyms:CHEMBL2316223
TypeSmall organic molecule
Emp. Form.C30H43N5O4
Mol. Mass.537.6935
SMILESCN[C@@H](C)C(=O)N[C@@H](C1CCCCC1)C(=O)N1C[C@H]2CCCN2C[C@H]1C(=O)N[C@@H]1CCC(=O)c2ccccc12