Reaction Details
TargetAndrogen receptor
LigandBDBM50425733
Substrate/Competitorn/a
Meas. Tech.ChEMBL_933429 (CHEMBL2318841)
IC50 1500±n/a nM
Citation Munuganti, RSLeblanc, EAxerio-Cilies, PLabriere, CFrewin, KSingh, KHassona, MDLack, NALi, HBan, FTomlinson Guns, EYoung, RRennie, PSCherkasov, A Targeting the binding function 3 (BF3) site of the androgen receptor through virtual screening. 2. development of 2-((2-phenoxyethyl) thio)-1H-benzimidazole derivatives. J Med Chem56:1136-48 (2013) 
 
Androgen receptor
Name:Androgen receptor
Type:Receptor
Mol. Mass.:99185.27
Organism:Homo sapiens (Human)
Description:CHO cells were stably transfected with human AR gene.
Residue:920
BDBM50425733
NameBDBM50425733
Synonyms:CHEMBL2316547
TypeSmall organic molecule
Emp. Form.C16H16N2O3S2
Mol. Mass.348.44
SMILESNS(=O)(=O)c1cccc2cc(SCCOc3ccccc3)[nH]c12