Reaction Details
TargetAndrogen receptor
LigandBDBM50425774
Substrate/Competitorn/a
Meas. Tech.ChEMBL_933429 (CHEMBL2318841)
IC50 24100±n/a nM
Citation Munuganti, RSLeblanc, EAxerio-Cilies, PLabriere, CFrewin, KSingh, KHassona, MDLack, NALi, HBan, FTomlinson Guns, EYoung, RRennie, PSCherkasov, A Targeting the binding function 3 (BF3) site of the androgen receptor through virtual screening. 2. development of 2-((2-phenoxyethyl) thio)-1H-benzimidazole derivatives. J Med Chem56:1136-48 (2013) 
 
Androgen receptor
Name:Androgen receptor
Type:Receptor
Mol. Mass.:99185.27
Organism:Homo sapiens (Human)
Description:CHO cells were stably transfected with human AR gene.
Residue:920
BDBM50425774
NameBDBM50425774
Synonyms:CHEMBL2316564
TypeSmall organic molecule
Emp. Form.C19H22N2O2S
Mol. Mass.342.455
SMILESCOCCn1c(SCCOc2cccc(C)c2)nc2ccccc12