Reaction Details
TargetTyrosine-protein kinase ABL1
LigandBDBM50425781
Substrate/Competitorn/a
Meas. Tech.ChEMBL_937547 (CHEMBL2320772)
IC50 3.2±n/a nM
Citation Ren, XPan, XZhang, ZWang, DLu, XLi, YWen, DLong, HLuo, JFeng, YZhuang, XZhang, FLiu, JLeng, FLang, XBai, YShe, MTu, ZPan, JDing, K Identification of GZD824 as an orally bioavailable inhibitor that targets phosphorylated and nonphosphorylated breakpoint cluster region-Abelson (Bcr-Abl) kinase and overcomes clinically acquired mutation-induced resistance against imatinib. J Med Chem56:879-94 (2013) 
 
Tyrosine-protein kinase ABL1
Name:Tyrosine-protein kinase ABL1
Type:Enzyme
Mol. Mass.:122897.30
Organism:Homo sapiens (Human)
Description:P00519
Residue:1130
BDBM50425781
NameBDBM50425781
Synonyms:CHEMBL2316581
TypeSmall organic molecule
Emp. Form.C28H26F3N7O
Mol. Mass.533.5475
SMILESCN1CCN(Cc2ccc(NC(=O)c3ccc(C)c(c3)C#Cc3cnc4ncnn4c3)cc2C(F)(F)F)CC1