Reaction Details
TargetDual specificity protein phosphatase CDC14A
LigandBDBM50425808
Substrate/Competitorn/a
Meas. Tech.ChEMBL_937592 (CHEMBL2321061)
IC50 21000±n/a nM
Citation He, YXu, JYu, ZHGunawan, AMWu, LWang, LZhang, ZY Discovery and evaluation of novel inhibitors of mycobacterium protein tyrosine phosphatase B from the 6-Hydroxy-benzofuran-5-carboxylic acid scaffold. J Med Chem56:832-42 (2013) 
 
Dual specificity protein phosphatase CDC14A
Name:Dual specificity protein phosphatase CDC14A
Type:n/a
Mol. Mass.:66598.40
Organism:Homo sapiens (Human)
Description:Q9UNH5
Residue:594
BDBM50425808
NameBDBM50425808
Synonyms:CHEMBL2316906
TypeSmall organic molecule
Emp. Form.C23H12F2O4
Mol. Mass.390.3358
SMILESOC(=O)c1cc2c(C#Cc3cc(F)cc(F)c3)c(oc2cc1O)-c1ccccc1