Reaction Details
TargetHepatocyte growth factor receptor
LigandBDBM50425831
Substrate/Competitorn/a
Meas. Tech.ChEMBL_937898 (CHEMBL2317038)
IC50 4510±n/a nM
Citation Powell, NAHoffman, JKCiske, FLKaufman, MDKohrt, JTQuin, JSheehan, DJDelaney, ABaxi, SMCatana, CMcConnell, POhren, JPerrin, LAEdmunds, JJ Highly selective 2,4-diaminopyrimidine-5-carboxamide inhibitors of Sky kinase. Bioorg Med Chem Lett23:1046-50 (2013) 
 
Hepatocyte growth factor receptor
Name:Hepatocyte growth factor receptor
Type:Protein
Mol. Mass.:155559.73
Organism:Homo sapiens (Human)
Description:P08581
Residue:1390
BDBM50425831
NameBDBM50425831
Synonyms:CHEMBL2312301
TypeSmall organic molecule
Emp. Form.C25H34N6O3
Mol. Mass.466.5759
SMILESCOc1ccccc1CNc1ncc(C(=O)NCCCN2CCCC2=O)c(NC2CCCC2)n1