Reaction Details
TargetProtein kinase C zeta type
LigandBDBM50425829
Substrate/Competitorn/a
Meas. Tech.ChEMBL_933462 (CHEMBL2319118)
IC50>30000±n/a nM
Citation Powell, NAHoffman, JKCiske, FLKaufman, MDKohrt, JTQuin, JSheehan, DJDelaney, ABaxi, SMCatana, CMcConnell, POhren, JPerrin, LAEdmunds, JJ Highly selective 2,4-diaminopyrimidine-5-carboxamide inhibitors of Sky kinase. Bioorg Med Chem Lett23:1046-50 (2013) 
 
Protein kinase C zeta type
Name:Protein kinase C zeta type
Type:Enzyme
Mol. Mass.:67649.13
Organism:Homo sapiens (Human)
Description:n/a
Residue:592
BDBM50425829
NameBDBM50425829
Synonyms:CHEMBL2312304
TypeSmall organic molecule
Emp. Form.C23H28Cl2N6O3
Mol. Mass.507.413
SMILESClc1ccc(Cl)c(CNc2ncc(C(=O)NCCCN3CCOC3=O)c(NC3CCCC3)n2)c1