Reaction Details
TargetSerine/threonine-protein kinase PAK 4
LigandBDBM50425830
Substrate/Competitorn/a
Meas. Tech.ChEMBL_933468 (CHEMBL2319124)
IC50>30000±n/a nM
Citation Powell, NAHoffman, JKCiske, FLKaufman, MDKohrt, JTQuin, JSheehan, DJDelaney, ABaxi, SMCatana, CMcConnell, POhren, JPerrin, LAEdmunds, JJ Highly selective 2,4-diaminopyrimidine-5-carboxamide inhibitors of Sky kinase. Bioorg Med Chem Lett23:1046-50 (2013) 
 
Serine/threonine-protein kinase PAK 4
Name:Serine/threonine-protein kinase PAK 4
Type:Protein
Mol. Mass.:64098.01
Organism:Homo sapiens (Human)
Description:O96013
Residue:591
BDBM50425830
NameBDBM50425830
Synonyms:CHEMBL2312303
TypeSmall organic molecule
Emp. Form.C24H30Cl2N6O2
Mol. Mass.505.44
SMILESClc1ccc(Cl)c(CNc2ncc(C(=O)NCCCN3CCCC3=O)c(NC3CCCC3)n2)c1