Reaction Details
TargetMitogen-activated protein kinase 1
LigandBDBM50425829
Substrate/Competitorn/a
Meas. Tech.ChEMBL_933469 (CHEMBL2319125)
IC50 15950±n/a nM
Citation Powell, NAHoffman, JKCiske, FLKaufman, MDKohrt, JTQuin, JSheehan, DJDelaney, ABaxi, SMCatana, CMcConnell, POhren, JPerrin, LAEdmunds, JJ Highly selective 2,4-diaminopyrimidine-5-carboxamide inhibitors of Sky kinase. Bioorg Med Chem Lett23:1046-50 (2013) 
 
Mitogen-activated protein kinase 1
Name:Mitogen-activated protein kinase 1
Type:Ser/Thr Protein Kinase
Mol. Mass.:41392.76
Organism:Homo sapiens (Human)
Description:P28482
Residue:360
BDBM50425829
NameBDBM50425829
Synonyms:CHEMBL2312304
TypeSmall organic molecule
Emp. Form.C23H28Cl2N6O3
Mol. Mass.507.413
SMILESClc1ccc(Cl)c(CNc2ncc(C(=O)NCCCN3CCOC3=O)c(NC3CCCC3)n2)c1