Reaction Details
TargetEpidermal growth factor receptor
LigandBDBM50425832
Substrate/Competitorn/a
Meas. Tech.ChEMBL_933476 (CHEMBL2319132)
IC50>30000±n/a nM
Citation Powell, NAHoffman, JKCiske, FLKaufman, MDKohrt, JTQuin, JSheehan, DJDelaney, ABaxi, SMCatana, CMcConnell, POhren, JPerrin, LAEdmunds, JJ Highly selective 2,4-diaminopyrimidine-5-carboxamide inhibitors of Sky kinase. Bioorg Med Chem Lett23:1046-50 (2013) 
 
Epidermal growth factor receptor
Name:Epidermal growth factor receptor
Type:Receptor Kinase Domain
Mol. Mass.:134279.59
Organism:Homo sapiens (Human)
Description:P00533
Residue:1210
BDBM50425832
NameBDBM50425832
Synonyms:CHEMBL2312290
TypeSmall organic molecule
Emp. Form.C27H38N6O4
Mol. Mass.510.6284
SMILESCOc1ccc(CCNc2ncc(C(=O)NCCCN3CCCC3=O)c(NC3CCCC3)n2)cc1OC