Reaction Details
TargetTyrosine-protein kinase receptor TYRO3
LigandBDBM50425836
Substrate/Competitorn/a
Meas. Tech.ChEMBL_933487 (CHEMBL2319403)
IC50 9700±n/a nM
Citation Powell, NAHoffman, JKCiske, FLKaufman, MDKohrt, JTQuin, JSheehan, DJDelaney, ABaxi, SMCatana, CMcConnell, POhren, JPerrin, LAEdmunds, JJ Highly selective 2,4-diaminopyrimidine-5-carboxamide inhibitors of Sky kinase. Bioorg Med Chem Lett23:1046-50 (2013) 
 
Tyrosine-protein kinase receptor TYRO3
Name:Tyrosine-protein kinase receptor TYRO3
Type:Protein
Mol. Mass.:96894.13
Organism:Homo sapiens (Human)
Description:Q06418
Residue:890
BDBM50425836
NameBDBM50425836
Synonyms:CHEMBL2312298
TypeSmall organic molecule
Emp. Form.C25H31F3N6O2
Mol. Mass.504.5478
SMILESFC(F)(F)c1cccc(CNc2ncc(C(=O)NCCCN3CCCC3=O)c(NC3CCCC3)n2)c1