Reaction Details
TargetTyrosine-protein kinase receptor TYRO3
LigandBDBM50425838
Substrate/Competitorn/a
Meas. Tech.ChEMBL_933487 (CHEMBL2319403)
IC50 11200±n/a nM
Citation Powell, NAHoffman, JKCiske, FLKaufman, MDKohrt, JTQuin, JSheehan, DJDelaney, ABaxi, SMCatana, CMcConnell, POhren, JPerrin, LAEdmunds, JJ Highly selective 2,4-diaminopyrimidine-5-carboxamide inhibitors of Sky kinase. Bioorg Med Chem Lett23:1046-50 (2013) 
 
Tyrosine-protein kinase receptor TYRO3
Name:Tyrosine-protein kinase receptor TYRO3
Type:Protein
Mol. Mass.:96894.13
Organism:Homo sapiens (Human)
Description:Q06418
Residue:890
BDBM50425838
NameBDBM50425838
Synonyms:CHEMBL2312296
TypeSmall organic molecule
Emp. Form.C25H34N6O2
Mol. Mass.450.5765
SMILESCc1ccc(CNc2ncc(C(=O)NCCCN3CCCC3=O)c(NC3CCCC3)n2)cc1