Reaction Details
TargetTyrosine-protein kinase receptor TYRO3
LigandBDBM50425841
Substrate/Competitorn/a
Meas. Tech.ChEMBL_933487 (CHEMBL2319403)
IC50 2100±n/a nM
Citation Powell, NAHoffman, JKCiske, FLKaufman, MDKohrt, JTQuin, JSheehan, DJDelaney, ABaxi, SMCatana, CMcConnell, POhren, JPerrin, LAEdmunds, JJ Highly selective 2,4-diaminopyrimidine-5-carboxamide inhibitors of Sky kinase. Bioorg Med Chem Lett23:1046-50 (2013) 
 
Tyrosine-protein kinase receptor TYRO3
Name:Tyrosine-protein kinase receptor TYRO3
Type:Protein
Mol. Mass.:96894.13
Organism:Homo sapiens (Human)
Description:Q06418
Residue:890
BDBM50425841
NameBDBM50425841
Synonyms:CHEMBL2312293
TypeSmall organic molecule
Emp. Form.C24H32N6O2
Mol. Mass.436.5499
SMILESO=C(NCCCN1CCCC1=O)c1cnc(NCc2ccccc2)nc1NC1CCCC1