Reaction Details
TargetSerine/threonine-protein kinase Nek2
LigandBDBM50425862
Substrate/Competitorn/a
Meas. Tech.ChEMBL_933531 (CHEMBL2319693)
IC50 2510±n/a nM
Citation Powell, NAHoffman, JKCiske, FLKohrt, JTBaxi, SMPeng, YWZhong, MCatana, COhren, JPerrin, LAEdmunds, JJ Optimization of highly selective 2,4-diaminopyrimidine-5-carboxamide inhibitors of Sky kinase. Bioorg Med Chem Lett23:1051-5 (2013) 
 
Serine/threonine-protein kinase Nek2
Name:Serine/threonine-protein kinase Nek2
Type:Enzyme
Mol. Mass.:51776.96
Organism:Homo sapiens (Human)
Description:P51955
Residue:445
BDBM50425862
NameBDBM50425862
Synonyms:CHEMBL2312654
TypeSmall organic molecule
Emp. Form.C22H26Cl2N6O
Mol. Mass.461.387
SMILESCN(C)C1CCC(CC1)Nc1nc(Nc2cc(Cl)cc(Cl)c2)ncc1-c1cc(C)no1