Reaction Details
TargetMitogen-activated protein kinase kinase kinase kinase 4
LigandBDBM50425862
Substrate/Competitorn/a
Meas. Tech.ChEMBL_933538 (CHEMBL2319700)
IC50 18±n/a nM
Citation Powell, NAHoffman, JKCiske, FLKohrt, JTBaxi, SMPeng, YWZhong, MCatana, COhren, JPerrin, LAEdmunds, JJ Optimization of highly selective 2,4-diaminopyrimidine-5-carboxamide inhibitors of Sky kinase. Bioorg Med Chem Lett23:1051-5 (2013) 
 
Mitogen-activated protein kinase kinase kinase kinase 4
Name:Mitogen-activated protein kinase kinase kinase kinase 4
Type:Serine/threonine-protein kinase
Mol. Mass.:142114.73
Organism:Homo sapiens (Human)
Description:O95819
Residue:1239
BDBM50425862
NameBDBM50425862
Synonyms:CHEMBL2312654
TypeSmall organic molecule
Emp. Form.C22H26Cl2N6O
Mol. Mass.461.387
SMILESCN(C)C1CCC(CC1)Nc1nc(Nc2cc(Cl)cc(Cl)c2)ncc1-c1cc(C)no1