Reaction Details
TargetEpidermal growth factor receptor
LigandBDBM50425865
Substrate/Competitorn/a
Meas. Tech.ChEMBL_933957 (CHEMBL2317775)
IC50 30000±n/a nM
Citation Powell, NAHoffman, JKCiske, FLKohrt, JTBaxi, SMPeng, YWZhong, MCatana, COhren, JPerrin, LAEdmunds, JJ Optimization of highly selective 2,4-diaminopyrimidine-5-carboxamide inhibitors of Sky kinase. Bioorg Med Chem Lett23:1051-5 (2013) 
 
Epidermal growth factor receptor
Name:Epidermal growth factor receptor
Type:Receptor Kinase Domain
Mol. Mass.:134279.59
Organism:Homo sapiens (Human)
Description:P00533
Residue:1210
BDBM50425865
NameBDBM50425865
Synonyms:CHEMBL2312646
TypeSmall organic molecule
Emp. Form.C23H30Cl2N6O
Mol. Mass.477.43
SMILESCN1CCC(CC1)NC(=O)c1cnc(NCc2cc(Cl)ccc2Cl)nc1NC1CCCC1