Reaction Details
TargetTyrosine-protein kinase ABL1
LigandBDBM50425862
Substrate/Competitorn/a
Meas. Tech.ChEMBL_933970 (CHEMBL2317788)
IC50 810±n/a nM
Citation Powell, NAHoffman, JKCiske, FLKohrt, JTBaxi, SMPeng, YWZhong, MCatana, COhren, JPerrin, LAEdmunds, JJ Optimization of highly selective 2,4-diaminopyrimidine-5-carboxamide inhibitors of Sky kinase. Bioorg Med Chem Lett23:1051-5 (2013) 
 
Tyrosine-protein kinase ABL1
Name:Tyrosine-protein kinase ABL1
Type:Enzyme
Mol. Mass.:122897.30
Organism:Homo sapiens (Human)
Description:P00519
Residue:1130
BDBM50425862
NameBDBM50425862
Synonyms:CHEMBL2312654
TypeSmall organic molecule
Emp. Form.C22H26Cl2N6O
Mol. Mass.461.387
SMILESCN(C)C1CCC(CC1)Nc1nc(Nc2cc(Cl)cc(Cl)c2)ncc1-c1cc(C)no1