Reaction Details
TargetP-selectin
LigandBDBM50425870
Substrate/Competitorn/a
Meas. Tech.ChEMBL_933984 (CHEMBL2318062)
IC50 580±n/a nM
Citation Powell, NAHoffman, JKCiske, FLKohrt, JTBaxi, SMPeng, YWZhong, MCatana, COhren, JPerrin, LAEdmunds, JJ Optimization of highly selective 2,4-diaminopyrimidine-5-carboxamide inhibitors of Sky kinase. Bioorg Med Chem Lett23:1051-5 (2013) 
 
P-selectin
Name:P-selectin
Type:PROTEIN
Mol. Mass.:90834.61
Organism:Homo sapiens (Human)
Description:ChEMBL_1438999
Residue:830
BDBM50425870
NameBDBM50425870
Synonyms:CHEMBL2311550
TypeSmall organic molecule
Emp. Form.C21H28Cl2N6O2
Mol. Mass.467.392
SMILESCC[C@@H](CO)Nc1nc(Nc2cc(Cl)cc(Cl)c2)ncc1C(=O)NC1CCN(C)CC1