Reaction Details
TargetP-selectin
LigandBDBM50425873
Substrate/Competitorn/a
Meas. Tech.ChEMBL_933984 (CHEMBL2318062)
IC50 1100±n/a nM
Citation Powell, NAHoffman, JKCiske, FLKohrt, JTBaxi, SMPeng, YWZhong, MCatana, COhren, JPerrin, LAEdmunds, JJ Optimization of highly selective 2,4-diaminopyrimidine-5-carboxamide inhibitors of Sky kinase. Bioorg Med Chem Lett23:1051-5 (2013) 
 
P-selectin
Name:P-selectin
Type:PROTEIN
Mol. Mass.:90834.61
Organism:Homo sapiens (Human)
Description:ChEMBL_1438999
Residue:830
BDBM50425873
NameBDBM50425873
Synonyms:CHEMBL2312648
TypeSmall organic molecule
Emp. Form.C26H37Cl2N7O
Mol. Mass.534.524
SMILESCN(C)C1CCC(CC1)Nc1nc(NCc2cc(Cl)ccc2Cl)ncc1C(=O)NC1CCN(C)CC1