Reaction Details
TargetP-selectin
LigandBDBM50425875
Substrate/Competitorn/a
Meas. Tech.ChEMBL_933984 (CHEMBL2318062)
IC50 7100±n/a nM
Citation Powell, NAHoffman, JKCiske, FLKohrt, JTBaxi, SMPeng, YWZhong, MCatana, COhren, JPerrin, LAEdmunds, JJ Optimization of highly selective 2,4-diaminopyrimidine-5-carboxamide inhibitors of Sky kinase. Bioorg Med Chem Lett23:1051-5 (2013) 
 
P-selectin
Name:P-selectin
Type:PROTEIN
Mol. Mass.:90834.61
Organism:Homo sapiens (Human)
Description:ChEMBL_1438999
Residue:830
BDBM50425875
NameBDBM50425875
Synonyms:CHEMBL2312644
TypeSmall organic molecule
Emp. Form.C24H36N6O2
Mol. Mass.440.5816
SMILESCOc1ccccc1CNc1ncc(C(=O)NCCCCN(C)C)c(NC2CCCC2)n1