Reaction Details
TargetTyrosine-protein kinase receptor TYRO3
LigandBDBM50425862
Substrate/Competitorn/a
Meas. Tech.ChEMBL_933985 (CHEMBL2318063)
IC50 0.700000±n/a nM
Citation Powell, NAHoffman, JKCiske, FLKohrt, JTBaxi, SMPeng, YWZhong, MCatana, COhren, JPerrin, LAEdmunds, JJ Optimization of highly selective 2,4-diaminopyrimidine-5-carboxamide inhibitors of Sky kinase. Bioorg Med Chem Lett23:1051-5 (2013) 
 
Tyrosine-protein kinase receptor TYRO3
Name:Tyrosine-protein kinase receptor TYRO3
Type:Protein
Mol. Mass.:96894.13
Organism:Homo sapiens (Human)
Description:Q06418
Residue:890
BDBM50425862
NameBDBM50425862
Synonyms:CHEMBL2312654
TypeSmall organic molecule
Emp. Form.C22H26Cl2N6O
Mol. Mass.461.387
SMILESCN(C)C1CCC(CC1)Nc1nc(Nc2cc(Cl)cc(Cl)c2)ncc1-c1cc(C)no1