Reaction Details
TargetTyrosine-protein kinase receptor TYRO3
LigandBDBM50425869
Substrate/Competitorn/a
Meas. Tech.ChEMBL_933985 (CHEMBL2318063)
IC50 92±n/a nM
Citation Powell, NAHoffman, JKCiske, FLKohrt, JTBaxi, SMPeng, YWZhong, MCatana, COhren, JPerrin, LAEdmunds, JJ Optimization of highly selective 2,4-diaminopyrimidine-5-carboxamide inhibitors of Sky kinase. Bioorg Med Chem Lett23:1051-5 (2013) 
 
Tyrosine-protein kinase receptor TYRO3
Name:Tyrosine-protein kinase receptor TYRO3
Type:Protein
Mol. Mass.:96894.13
Organism:Homo sapiens (Human)
Description:Q06418
Residue:890
BDBM50425869
NameBDBM50425869
Synonyms:CHEMBL2312653
TypeSmall organic molecule
Emp. Form.C19H20Cl2N6O
Mol. Mass.419.308
SMILESCc1cc(on1)-c1cnc(Nc2cc(Cl)cc(Cl)c2)nc1NC1CCNCC1