Reaction Details
TargetTyrosine-protein kinase receptor TYRO3
LigandBDBM50425865
Substrate/Competitorn/a
Meas. Tech.ChEMBL_933985 (CHEMBL2318063)
IC50 270±n/a nM
Citation Powell, NAHoffman, JKCiske, FLKohrt, JTBaxi, SMPeng, YWZhong, MCatana, COhren, JPerrin, LAEdmunds, JJ Optimization of highly selective 2,4-diaminopyrimidine-5-carboxamide inhibitors of Sky kinase. Bioorg Med Chem Lett23:1051-5 (2013) 
 
Tyrosine-protein kinase receptor TYRO3
Name:Tyrosine-protein kinase receptor TYRO3
Type:Protein
Mol. Mass.:96894.13
Organism:Homo sapiens (Human)
Description:Q06418
Residue:890
BDBM50425865
NameBDBM50425865
Synonyms:CHEMBL2312646
TypeSmall organic molecule
Emp. Form.C23H30Cl2N6O
Mol. Mass.477.43
SMILESCN1CCC(CC1)NC(=O)c1cnc(NCc2cc(Cl)ccc2Cl)nc1NC1CCCC1