Reaction Details
TargetTyrosine-protein kinase receptor TYRO3
LigandBDBM50425876
Substrate/Competitorn/a
Meas. Tech.ChEMBL_933985 (CHEMBL2318063)
IC50 380±n/a nM
Citation Powell, NAHoffman, JKCiske, FLKohrt, JTBaxi, SMPeng, YWZhong, MCatana, COhren, JPerrin, LAEdmunds, JJ Optimization of highly selective 2,4-diaminopyrimidine-5-carboxamide inhibitors of Sky kinase. Bioorg Med Chem Lett23:1051-5 (2013) 
 
Tyrosine-protein kinase receptor TYRO3
Name:Tyrosine-protein kinase receptor TYRO3
Type:Protein
Mol. Mass.:96894.13
Organism:Homo sapiens (Human)
Description:Q06418
Residue:890
BDBM50425876
NameBDBM50425876
Synonyms:CHEMBL2312343
TypeSmall organic molecule
Emp. Form.C22H30N6O3
Mol. Mass.426.512
SMILESCOc1ccccc1CNc1ncc(C(=O)NCCNC(C)=O)c(NC2CCCC2)n1