Reaction Details
TargetHistone deacetylase 1
LigandBDBM50425908
Substrate/Competitorn/a
Meas. Tech.ChEMBL_934018 (CHEMBL2318096)
IC50 0.750000±n/a nM
Citation Narita, KFukui, YSano, YYamori, TIto, AYoshida, MKatoh, T Total synthesis of bicyclic depsipeptides spiruchostatins C and D and investigation of their histone deacetylase inhibitory and antiproliferative activities. Eur J Med Chem60:295-304 (2013) 
 
Histone deacetylase 1
Name:Histone deacetylase 1
Type:Enzyme
Mol. Mass.:55090.27
Organism:Homo sapiens (Human)
Description:Q13547
Residue:482
BDBM50425908
NameBDBM50425908
Synonyms:CHEMBL2313363
TypeSmall organic molecule
Emp. Form.C22H35N3O6S2
Mol. Mass.501.66
SMILESCC(C)[C@H]1NC(=O)[C@H]2CSSCC\C=C\[C@H](CC(=O)N[C@H](C(C)C)C(=O)N2)OC(=O)C[C@@H]1O