Reaction Details
TargetAlbumin
LigandBDBM50425934
Substrate/Competitorn/a
Meas. Tech.ChEMBL_934194 (CHEMBL2319454)
IC50 6300±n/a nM
Citation Shantharam, CSSuyoga Vardhan, DMSuhas, RSridhara, MBGowda, DC Inhibition of protein glycation by urea and thiourea derivatives of glycine/proline conjugated benzisoxazole analogue - synthesis and structure-activity studies. Eur J Med Chem60:325-32 (2013) 
 
Albumin
Name:Albumin
Type:PROTEIN
Mol. Mass.:69288.15
Organism:Bos taurus
Description:ChEMBL_1502598
Residue:607
BDBM50425934
NameBDBM50425934
Synonyms:CHEMBL2313727
TypeSmall organic molecule
Emp. Form.C21H20BrFN4O2S
Mol. Mass.491.377
SMILESFc1ccc2c(noc2c1)C1CCN(CC1)C(=O)CNC(=S)Nc1ccccc1Br