Reaction Details
TargetInduced myeloid leukemia cell differentiation protein Mcl-1
LigandBDBM50425962
Substrate/Competitorn/a
Meas. Tech.ChEMBL_934367 (CHEMBL2320595)
Ki 109000±n/a nM
Citation Zhang, ZLiu, CLi, XSong, TWu, ZLiang, XZhao, YShen, XChen, H Fragment-based design, synthesis, and biological evaluation of N-substituted-5-(4-isopropylthiophenol)-2-hydroxynicotinamide derivatives as novel Mcl-1 inhibitors. Eur J Med Chem60:410-20 (2013) 
 
Induced myeloid leukemia cell differentiation protein Mcl-1
Name:Induced myeloid leukemia cell differentiation protein Mcl-1
Type:Membrane; Single-pass membrane protein
Mol. Mass.:37332.87
Organism:Homo sapiens (Human)
Description:Q07820
Residue:350
BDBM50425962
NameBDBM50425962
Synonyms:2-Hydroxynicotinonitrile | CHEMBL2314370
TypeSmall organic molecule
Emp. Form.C6H4N2O
Mol. Mass.120.1088
SMILESO=c1[nH]cccc1C#N