Reaction Details
TargetInduced myeloid leukemia cell differentiation protein Mcl-1
LigandBDBM22853
Substrate/Competitorn/a
Meas. Tech.ChEMBL_934367 (CHEMBL2320595)
Ki 57000±n/a nM
Citation Zhang, ZLiu, CLi, XSong, TWu, ZLiang, XZhao, YShen, XChen, H Fragment-based design, synthesis, and biological evaluation of N-substituted-5-(4-isopropylthiophenol)-2-hydroxynicotinamide derivatives as novel Mcl-1 inhibitors. Eur J Med Chem60:410-20 (2013) 
 
Induced myeloid leukemia cell differentiation protein Mcl-1
Name:Induced myeloid leukemia cell differentiation protein Mcl-1
Type:Membrane; Single-pass membrane protein
Mol. Mass.:37332.87
Organism:Homo sapiens (Human)
Description:Q07820
Residue:350
BDBM22853
NameBDBM22853
Synonyms:1,2-Dione-Based Compound, 10 | 1,2-dihydroacenaphthylenedione
TypeSmall organic molecule
Emp. Form.C12H6O2
Mol. Mass.182.1748
SMILESO=c1c2cccc3cccc(c23)c1=O