Reaction Details
TargetPoly [ADP-ribose] polymerase tankyrase-2
LigandBDBM50425969
Substrate/Competitorn/a
Meas. Tech.ChEMBL_934569 (CHEMBL2317530)
IC50 2.0±n/a nM
Citation Bregman, HGunaydin, HGu, YSchneider, SWilson, CDiMauro, EFHuang, X Discovery of a class of novel tankyrase inhibitors that bind to both the nicotinamide pocket and the induced pocket. J Med Chem56:1341-5 (2013) 
 
Poly [ADP-ribose] polymerase tankyrase-2
Name:Poly [ADP-ribose] polymerase tankyrase-2
Type:Enzyme
Mol. Mass.:126937.16
Organism:Homo sapiens (Human)
Description:Q9H2K2
Residue:1166
BDBM50425969
NameBDBM50425969
Synonyms:CHEMBL2314698
TypeSmall organic molecule
Emp. Form.C25H22N4O4
Mol. Mass.442.4666
SMILESCOc1ccccc1NC(=O)c1ccc(NC(=O)CCc2nc3ccccc3c(=O)[nH]2)cc1